{"text_format":"1","workbook":"xlsx","n_sheets":10,"sheets":["Instructions","Campers Page 1","Campers Page 2","Leaders & Financials","Hidden Sheet","Ethnicity Report","Male Cabin Roster","Female Cabin Roster","Housing Request","Housing List"],"not_rendered":{"charts":0,"images":5,"macros":1,"external_links":0,"defined_names":11,"comments":0,"pivot_tables":0},"unopened":[],"bounds":{"document_bytes":16777216,"sheet_cells":100000,"rows_first":2000,"rows_last":500,"rows_between":2000,"halvings":0,"cell_chars":16384,"cell_head_chars":4096},"cells_cut":0,"cells_raw":0,"read":"whole","date_system":"1900"}

{"sheet":"Instructions","index":0,"n_rows":19,"n_cols":2,"rows_kept":19,"cut":false,"hidden":false,"merged":[[12,1,12,9],[15,1,15,9],[18,1,18,9],[1,0,1,5],[3,0,3,9],[6,1,6,9],[9,1,9,9]]}
[]
["Young Life Adventures Santa Cruz Registration Packet"]
[]
["Welcome to the Adventures Santa Cruz Registration Packet.  This workbook prepopulates some of the information for you. Please read below for detailed instructions for completing each tab. Once it is completed, return to the camp office via email. Please call us at 530-448-6026 with questions!"]
[]
["Campers Page 1 & Campers Page 2"]
[null,"Start off by entering the requested information in the blanks at the top of the form. Then enter all campers names on Campers Page 1 of the A Form. If more room is needed, move on to Campers Page 2. Be sure to mark Male or Female, what type of health form, and if they are a repeat camper (enter 2, 3, or 4). If you use camp trip manager, you may copy and paste the names from the A form it generates, but make sure you right click and 'Paste Special'- paste the values only.  "]
[]
{"$rows_left_out":12}
{"sheet":"Campers Page 1","index":1,"n_rows":60,"n_cols":20,"rows_kept":60,"cut":false,"hidden":false,"merged":[[1,2,4,13],[14,1,14,7],[14,10,14,16],[8,4,8,7],[6,2,6,7],[7,2,7,7],[7,11,7,16]]}
[]
[null,null,"YOUNG LIFE SUMMER CAMP REGISTRATION"]
[]
[]
[]
[]
[null,"CAMP NAME","YL Adventures Santa Cruz",null,null,null,null,null,null,null,"AREA NUMBER"]
[null,"CAMP TYPE","Discipleship",null,null,null,null,null,null,null,"AREA NAME"]
{"$rows_left_out":53}
{"sheet":"Campers Page 2","index":2,"n_rows":61,"n_cols":20,"rows_kept":61,"cut":false,"hidden":false,"merged":[[13,1,13,7],[13,10,13,16],[10,1,11,16],[1,2,4,13],[6,2,6,7],[7,2,7,7],[7,11,7,16],[8,4,8,7]]}
[]
[null,null,"YOUNG LIFE SUMMER CAMP REGISTRATION"]
[]
[]
[]
[]
[null,"CAMP NAME",{"$f":"'Campers Page 1'!C7:H7","v":"YL Adventures Santa Cruz"},null,null,null,null,null,null,null,"AREA NUMBER",{"$f":"'Campers Page 1'!L7","v":0}]
[null,"CAMP TYPE",{"$f":"'Campers Page 1'!C8:H8","v":"Discipleship"},null,null,null,null,null,null,null,"AREA NAME",{"$f":"'Campers Page 1'!L8:Q8","v":0}]
{"$rows_left_out":54}
{"sheet":"Leaders & Financials","index":3,"n_rows":54,"n_cols":16,"rows_kept":54,"cut":false,"hidden":false,"merged":[[18,9,18,12],[28,1,28,7],[28,9,28,12],[29,9,29,11],[15,9,15,11],[16,9,16,11],[10,10,10,11],[10,12,11,12],[12,9,12,12],[13,9,13,11],[14,9,14,11],[0,2,2,11],[4,9,4,12],[5,9,5,12],[6,9,6,12],[3,10,3,12],[4,1,4,7],[35,9,35,10],[19,9,19,12],[21,11,21,12],[25,8,25,11],[26,8,26,11],[30,9,30,11],[47,3,47,6],[47,10,47,11],[49,4,49,7],[29,7,30,7],[41,9,41,11],[44,1,44,6],[44,9,44,12],[29,1,30,1],[29,2,30,2],[29,3,30,3],[29,4,30,4],[29,6,30,6],[29,5,30,5],[31,9,31,11],[33,9,33,10],[34,9,34,10],[45,3,45,6],[37,9,37,10],[39,9,39,11],[40,9,40,11],[53,1,53,2],[50,1,50,2],[50,4,50,7],[53,4,53,7],[50,9,50,10],[52,4,52,7],[49,1,49,2],[52,1,52,2],[46,1,46,2],[46,3,46,6],[46,10,46,11],[47,1,47,2]]}
[null,null,"YOUNG LIFE SUMMER CAMP REGISTRATION"]
[]
[]
[null,null,null,null,null,null,null,null,null,{"$f":"'Campers Page 1'!L7","v":0},{"$f":"'Campers Page 1'!L8","v":0}]
[null,"VOLUNTEER LEADERS",null,null,null,null,null,null,null,"FINANCIAL SUMMARY"]
[null,"LAST NAME","FIRST NAME","MALE","FEMALE","ONLINE HC FORM","PAPER HC FORM","LEADER ORIENTATION",null,"TRIP LEADER: DO NOT COMPLETE THIS SECTION\nCompleted by camp office during payment"]
[1,null,null,null,null,null,null,null,null,"CAMP FEES",null,null,null,null,"Beyond Malibu","6th Grade Outreach"]
[{"$f":"A7+1","v":2},null,null,null,null,null,null,null,null,null,"Number","x Camp Fee","= Amount",null,"Breakaway Lodge","9th Grade Outreach"]
{"$rows_left_out":47}
{"sheet":"Hidden Sheet","index":4,"n_rows":163,"n_cols":13,"rows_kept":163,"cut":false,"hidden":false,"merged":[]}
[null,"Female Leader Total From A Form",{"$f":"'Leaders & Financials'!E43","v":0},null,"Female Camper Names","Male Camper Names","Female Leader Names","Male Leader Names",null,"Actual Female Camper Name","Actual Male Camper Names","Actual Female Leader Names","Actual Male Leader Names"]
[null,"Female Camper Total From A Form",{"$f":"'Campers Page 2'!N57","v":0}]
[null,null,null,null,{"$f":"IF('Campers Page 1'!E17<>0,(CONCATENATE('Campers Page 1'!C17,\" \",'Campers Page 1'!B17)),\"\")","v":""},{"$f":"IF('Campers Page 1'!D17<>0,(CONCATENATE('Campers Page 1'!C17,\" \",'Campers Page 1'!B17)),\"\")","v":""},{"$f":"IF('Leaders & Financials'!E7<>0,(CONCATENATE('Leaders & Financials'!C7,\" \",'Leaders & Financials'!B7)),\"\")","v":""},{"$f":"IF('Leaders & Financials'!D7<>0,(CONCATENATE('Leaders & Financials'!C7,\" \",'Leaders & Financials'!B7)),\"\")","v":""},null,{"$f":"IFERROR(INDEX($E$2:$E$162,SMALL(IF(($E$2:$E$162)<>\"\",ROW($E$1:$E$161),\"\"),ROW(J1))),\"\")","v":""},{"$f":"IFERROR(INDEX($F$2:$F$162,SMALL(IF(($F$2:$F$162)<>\"\",ROW($F$1:$F$161),\"\"),ROW(K1))),\"\")","v":""},{"$f":"IFERROR(INDEX($G$2:$G$32,SMALL(IF(($G$2:$G$32)<>\"\",ROW($G$1:$G$31),\"\"),ROW(L1))),\"\")","v":""},{"$f":"IFERROR(INDEX($H$2:$H$32,SMALL(IF(($H$2:$H$32)<>\"\",ROW($H$1:$H$31),\"\"),ROW(M1))),\"\")","v":""}]
[null,"Female Leader Total From Cabin Roster",{"$f":"COUNTA('Female Cabin Roster'!E10:E14,'Female Cabin Roster'!K10:K14,'Female Cabin Roster'!Q10:Q14,'Female Cabin Roster'!E39:E43,'Female Cabin Roster'!K39:K43,'Female Cabin Roster'!Q39:Q43,'Female Cabin Roster'!E68:E72,'Female Cabin Roster'!K68:K72,'Female Cabin Roster'!Q68:Q72,'Female Cabin Roster'!E97:E101,'Female Cabin Roster'!K97:K101,'Female Cabin Roster'!Q97:Q101)","v":0},null,{"$f":"IF('Campers Page 1'!E18<>0,(CONCATENATE('Campers Page 1'!C18,\" \",'Campers Page 1'!B18)),\"\")","v":""},{"$f":"IF('Campers Page 1'!D18<>0,(CONCATENATE('Campers Page 1'!C18,\" \",'Campers Page 1'!B18)),\"\")","v":""},{"$f":"IF('Leaders & Financials'!E8<>0,(CONCATENATE('Leaders & Financials'!C8,\" \",'Leaders & Financials'!B8)),\"\")","v":""},{"$f":"IF('Leaders & Financials'!D8<>0,(CONCATENATE('Leaders & Financials'!C8,\" \",'Leaders & Financials'!B8)),\"\")","v":""},null,{"$f":"IFERROR(INDEX($E$2:$E$162,SMALL(IF(($E$2:$E$162)<>\"\",ROW($E$1:$E$161),\"\"),ROW(J2))),\"\")","v":""},{"$f":"IFERROR(INDEX($F$2:$F$162,SMALL(IF(($F$2:$F$162)<>\"\",ROW($F$1:$F$161),\"\"),ROW(K2))),\"\")","v":""},{"$f":"IFERROR(INDEX($G$2:$G$32,SMALL(IF(($G$2:$G$32)<>\"\",ROW($G$1:$G$31),\"\"),ROW(L2))),\"\")","v":""},{"$f":"IFERROR(INDEX($H$2:$H$32,SMALL(IF(($H$2:$H$32)<>\"\",ROW($H$1:$H$31),\"\"),ROW(M2))),\"\")","v":""}]
[null,"Female Camper Total From Cabin Roster",{"$f":"COUNTA('Female Cabin Roster'!E16:E33,'Female Cabin Roster'!K16:K33,'Female Cabin Roster'!Q16:Q33,'Female Cabin Roster'!E45:E62,'Female Cabin Roster'!K45:K62,'Female Cabin Roster'!Q45:Q62,'Female Cabin Roster'!E74:E91,'Female Cabin Roster'!K74:K91,'Female Cabin Roster'!Q74:Q91,'Female Cabin Roster'!E103:E120,'Female Cabin Roster'!K103:K120,'Female Cabin Roster'!Q103:Q120)","v":0},null,{"$f":"IF('Campers Page 1'!E19<>0,(CONCATENATE('Campers Page 1'!C19,\" \",'Campers Page 1'!B19)),\"\")","v":""},{"$f":"IF('Campers Page 1'!D19<>0,(CONCATENATE('Campers Page 1'!C19,\" \",'Campers Page 1'!B19)),\"\")","v":""},{"$f":"IF('Leaders & Financials'!E9<>0,(CONCATENATE('Leaders & Financials'!C9,\" \",'Leaders & Financials'!B9)),\"\")","v":""},{"$f":"IF('Leaders & Financials'!D9<>0,(CONCATENATE('Leaders & Financials'!C9,\" \",'Leaders & Financials'!B9)),\"\")","v":""},null,{"$f":"IFERROR(INDEX($E$2:$E$162,SMALL(IF(($E$2:$E$162)<>\"\",ROW($E$1:$E$161),\"\"),ROW(J3))),\"\")","v":""},{"$f":"IFERROR(INDEX($F$2:$F$162,SMALL(IF(($F$2:$F$162)<>\"\",ROW($F$1:$F$161),\"\"),ROW(K3))),\"\")","v":""},{"$f":"IFERROR(INDEX($G$2:$G$32,SMALL(IF(($G$2:$G$32)<>\"\",ROW($G$1:$G$31),\"\"),ROW(L3))),\"\")","v":""},{"$f":"IFERROR(INDEX($H$2:$H$32,SMALL(IF(($H$2:$H$32)<>\"\",ROW($H$1:$H$31),\"\"),ROW(M3))),\"\")","v":""}]
[null,null,null,null,{"$f":"IF('Campers Page 1'!E20<>0,(CONCATENATE('Campers Page 1'!C20,\" \",'Campers Page 1'!B20)),\"\")","v":""},{"$f":"IF('Campers Page 1'!D20<>0,(CONCATENATE('Campers Page 1'!C20,\" \",'Campers Page 1'!B20)),\"\")","v":""},{"$f":"IF('Leaders & Financials'!E10<>0,(CONCATENATE('Leaders & Financials'!C10,\" \",'Leaders & Financials'!B10)),\"\")","v":""},{"$f":"IF('Leaders & Financials'!D10<>0,(CONCATENATE('Leaders & Financials'!C10,\" \",'Leaders & Financials'!B10)),\"\")","v":""},null,{"$f":"IFERROR(INDEX($E$2:$E$162,SMALL(IF(($E$2:$E$162)<>\"\",ROW($E$1:$E$161),\"\"),ROW(J4))),\"\")","v":""},{"$f":"IFERROR(INDEX($F$2:$F$162,SMALL(IF(($F$2:$F$162)<>\"\",ROW($F$1:$F$161),\"\"),ROW(K4))),\"\")","v":""},{"$f":"IFERROR(INDEX($G$2:$G$32,SMALL(IF(($G$2:$G$32)<>\"\",ROW($G$1:$G$31),\"\"),ROW(L4))),\"\")","v":""},{"$f":"IFERROR(INDEX($H$2:$H$32,SMALL(IF(($H$2:$H$32)<>\"\",ROW($H$1:$H$31),\"\"),ROW(M4))),\"\")","v":""}]
[null,"Male Leader Total From A Form",{"$f":"'Leaders & Financials'!D43","v":0},null,{"$f":"IF('Campers Page 1'!E21<>0,(CONCATENATE('Campers Page 1'!C21,\" \",'Campers Page 1'!B21)),\"\")","v":""},{"$f":"IF('Campers Page 1'!D21<>0,(CONCATENATE('Campers Page 1'!C21,\" \",'Campers Page 1'!B21)),\"\")","v":""},{"$f":"IF('Leaders & Financials'!E11<>0,(CONCATENATE('Leaders & Financials'!C11,\" \",'Leaders & Financials'!B11)),\"\")","v":""},{"$f":"IF('Leaders & Financials'!D11<>0,(CONCATENATE('Leaders & Financials'!C11,\" \",'Leaders & Financials'!B11)),\"\")","v":""},null,{"$f":"IFERROR(INDEX($E$2:$E$162,SMALL(IF(($E$2:$E$162)<>\"\",ROW($E$1:$E$161),\"\"),ROW(J5))),\"\")","v":""},{"$f":"IFERROR(INDEX($F$2:$F$162,SMALL(IF(($F$2:$F$162)<>\"\",ROW($F$1:$F$161),\"\"),ROW(K5))),\"\")","v":""},{"$f":"IFERROR(INDEX($G$2:$G$32,SMALL(IF(($G$2:$G$32)<>\"\",ROW($G$1:$G$31),\"\"),ROW(L5))),\"\")","v":""},{"$f":"IFERROR(INDEX($H$2:$H$32,SMALL(IF(($H$2:$H$32)<>\"\",ROW($H$1:$H$31),\"\"),ROW(M5))),\"\")","v":""}]
[null,"Male Camper Total From A Form",{"$f":"'Campers Page 2'!M57","v":0},null,{"$f":"IF('Campers Page 1'!E22<>0,(CONCATENATE('Campers Page 1'!C22,\" \",'Campers Page 1'!B22)),\"\")","v":""},{"$f":"IF('Campers Page 1'!D22<>0,(CONCATENATE('Campers Page 1'!C22,\" \",'Campers Page 1'!B22)),\"\")","v":""},{"$f":"IF('Leaders & Financials'!E12<>0,(CONCATENATE('Leaders & Financials'!C12,\" \",'Leaders & Financials'!B12)),\"\")","v":""},{"$f":"IF('Leaders & Financials'!D12<>0,(CONCATENATE('Leaders & Financials'!C12,\" \",'Leaders & Financials'!B12)),\"\")","v":""},null,{"$f":"IFERROR(INDEX($E$2:$E$162,SMALL(IF(($E$2:$E$162)<>\"\",ROW($E$1:$E$161),\"\"),ROW(J6))),\"\")","v":""},{"$f":"IFERROR(INDEX($F$2:$F$162,SMALL(IF(($F$2:$F$162)<>\"\",ROW($F$1:$F$161),\"\"),ROW(K6))),\"\")","v":""},{"$f":"IFERROR(INDEX($G$2:$G$32,SMALL(IF(($G$2:$G$32)<>\"\",ROW($G$1:$G$31),\"\"),ROW(L6))),\"\")","v":""},{"$f":"IFERROR(INDEX($H$2:$H$32,SMALL(IF(($H$2:$H$32)<>\"\",ROW($H$1:$H$31),\"\"),ROW(M6))),\"\")","v":""}]
{"$rows_left_out":156}
{"sheet":"Ethnicity Report","index":5,"n_rows":17,"n_cols":9,"rows_kept":17,"cut":false,"hidden":false,"merged":[[5,1,5,8],[13,2,13,8],[14,2,14,8],[16,1,16,6]]}
[]
[null,"Area #",{"$f":"'Campers Page 1'!L7","v":0}]
[null,"Area Name",{"$f":"'Campers Page 1'!L8","v":0}]
[]
[]
[null,"We collect information from each area on the ethnic background of their campers and leaders. Complete the boxes below as they pertain to your group. When the numbers you entered equals the total campers on the A Form, the Totals column will no longer be highlighted. Thank you for providing this information to aid mission leadership in decision making!"]
[]
[null,"Please put the appropriate number in each box below."]
{"$rows_left_out":10}
{"sheet":"Male Cabin Roster","index":6,"n_rows":120,"n_cols":26,"rows_kept":120,"cut":false,"hidden":false,"merged":[[0,20,2,23],[0,25,2,25],[2,0,2,16],[1,1,1,13],[3,6,3,16],[3,3,3,4],[4,6,4,16],[7,1,7,5],[7,7,7,11],[7,13,7,17],[94,1,94,5],[94,7,94,11],[94,13,94,17],[36,1,36,5],[36,7,36,11],[36,13,36,17],[65,1,65,5],[65,7,65,11],[65,13,65,17]]}
[null,null,null,null,null,null,null,null,null,null,null,null,null,null,null,null,null,null,null,null,"Male Camper Name List                                                                                        (name will disappear when assigned to housing)",null,null,null,null,"Male Leader Name List"]
[null,"YLA Santa Cruz 1st Choice Male Cabin Roster"]
[]
[null,null,"Area #",{"$f":"'Campers Page 1'!L7","v":0},null,null,{"$f":"IF('Hidden Sheet'!C7='Hidden Sheet'!C10,\"\",\"Double Check Leader Names - Total Number Doesn't Match A Form\")","v":""},null,null,null,null,null,null,null,null,null,null,null,null,null,{"$f":"IF('Campers Page 1'!D17<>0,(CONCATENATE('Campers Page 1'!C17,\" \",'Campers Page 1'!B17)),\"\")","v":""},{"$f":"IF('Campers Page 1'!M17<>0,(CONCATENATE('Campers Page 1'!L17,\" \",'Campers Page 1'!K17)),\"\")","v":""},{"$f":"IF('Campers Page 2'!D16<>0,(CONCATENATE('Campers Page 2'!C16,\" \",'Campers Page 2'!B16)),\"\")","v":""},{"$f":"IF('Campers Page 2'!M16<>0,(CONCATENATE('Campers Page 2'!L16,\" \",'Campers Page 2'!K16)),\"\")","v":""},null,{"$f":"IF('Leaders & Financials'!D7<>0,(CONCATENATE('Leaders & Financials'!C7,\" \",'Leaders & Financials'!B7)),\"\")","v":""}]
[null,null,"Area Name",{"$f":"'Campers Page 1'!L8","v":0},null,null,{"$f":"IF('Hidden Sheet'!C8='Hidden Sheet'!C11,\"\",\"Double Check Camper Names - Total Number Doesn't Match A Form\")","v":""},null,null,null,null,null,null,null,null,null,null,null,null,null,{"$f":"IF('Campers Page 1'!D18<>0,(CONCATENATE('Campers Page 1'!C18,\" \",'Campers Page 1'!B18)),\"\")","v":""},{"$f":"IF('Campers Page 1'!M18<>0,(CONCATENATE('Campers Page 1'!L18,\" \",'Campers Page 1'!K18)),\"\")","v":""},{"$f":"IF('Campers Page 2'!D17<>0,(CONCATENATE('Campers Page 2'!C17,\" \",'Campers Page 2'!B17)),\"\")","v":""},{"$f":"IF('Campers Page 2'!M17<>0,(CONCATENATE('Campers Page 2'!L17,\" \",'Campers Page 2'!K17)),\"\")","v":""},null,{"$f":"IF('Leaders & Financials'!D8<>0,(CONCATENATE('Leaders & Financials'!C8,\" \",'Leaders & Financials'!B8)),\"\")","v":""}]
[null,null,null,null,null,null,null,null,null,null,null,null,null,null,null,null,null,null,null,null,{"$f":"IF('Campers Page 1'!D19<>0,(CONCATENATE('Campers Page 1'!C19,\" \",'Campers Page 1'!B19)),\"\")","v":""},{"$f":"IF('Campers Page 1'!M19<>0,(CONCATENATE('Campers Page 1'!L19,\" \",'Campers Page 1'!K19)),\"\")","v":""},{"$f":"IF('Campers Page 2'!D18<>0,(CONCATENATE('Campers Page 2'!C18,\" \",'Campers Page 2'!B18)),\"\")","v":""},{"$f":"IF('Campers Page 2'!M18<>0,(CONCATENATE('Campers Page 2'!L18,\" \",'Campers Page 2'!K18)),\"\")","v":""},null,{"$f":"IF('Leaders & Financials'!D9<>0,(CONCATENATE('Leaders & Financials'!C9,\" \",'Leaders & Financials'!B9)),\"\")","v":""}]
[null,null,null,null,null,null,null,null,null,null,null,null,null,null,null,null,null,null,null,null,{"$f":"IF('Campers Page 1'!D20<>0,(CONCATENATE('Campers Page 1'!C20,\" \",'Campers Page 1'!B20)),\"\")","v":""},{"$f":"IF('Campers Page 1'!M20<>0,(CONCATENATE('Campers Page 1'!L20,\" \",'Campers Page 1'!K20)),\"\")","v":""},{"$f":"IF('Campers Page 2'!D19<>0,(CONCATENATE('Campers Page 2'!C19,\" \",'Campers Page 2'!B19)),\"\")","v":""},{"$f":"IF('Campers Page 2'!M19<>0,(CONCATENATE('Campers Page 2'!L19,\" \",'Campers Page 2'!K19)),\"\")","v":""},null,{"$f":"IF('Leaders & Financials'!D10<>0,(CONCATENATE('Leaders & Financials'!C10,\" \",'Leaders & Financials'!B10)),\"\")","v":""}]
[null,"Male Cabin One",null,null,null,null,null,"Male Cabin Two",null,null,null,null,null,"Male Cabin Three",null,null,null,null,null,null,{"$f":"IF('Campers Page 1'!D21<>0,(CONCATENATE('Campers Page 1'!C21,\" \",'Campers Page 1'!B21)),\"\")","v":""},{"$f":"IF('Campers Page 1'!M21<>0,(CONCATENATE('Campers Page 1'!L21,\" \",'Campers Page 1'!K21)),\"\")","v":""},{"$f":"IF('Campers Page 2'!D20<>0,(CONCATENATE('Campers Page 2'!C20,\" \",'Campers Page 2'!B20)),\"\")","v":""},{"$f":"IF('Campers Page 2'!M20<>0,(CONCATENATE('Campers Page 2'!L20,\" \",'Campers Page 2'!K20)),\"\")","v":""},null,{"$f":"IF('Leaders & Financials'!D11<>0,(CONCATENATE('Leaders & Financials'!C11,\" \",'Leaders & Financials'!B11)),\"\")","v":""}]
{"$rows_left_out":113}
{"sheet":"Female Cabin Roster","index":7,"n_rows":120,"n_cols":26,"rows_kept":120,"cut":false,"hidden":false,"merged":[[7,13,7,17],[0,25,2,25],[0,20,2,23],[2,0,2,16],[7,1,7,5],[7,7,7,11],[1,1,1,13],[3,5,3,16],[4,5,4,16],[3,3,3,4],[94,1,94,5],[94,7,94,11],[94,13,94,17],[36,1,36,5],[36,7,36,11],[36,13,36,17],[65,1,65,5],[65,7,65,11],[65,13,65,17]]}
[null,null,null,null,null,null,null,null,null,null,null,null,null,null,null,null,null,null,null,null,"Female Camper Name List                                                                         (name will disappear when assigned to housing)",null,null,null,null,"Female Leader Name List"]
[null,"YLA Santa Cruz 1st Choice Female Cabin Roster"]
[]
[null,null,"Area #",{"$f":"'Campers Page 1'!L7","v":0},null,{"$f":"IF('Hidden Sheet'!C4='Hidden Sheet'!C1,\"\",\"Double Check Leader Names - Total Number Doesn't Match A Form\")","v":""},null,null,null,null,null,null,null,null,null,null,null,null,null,null,{"$f":"IF('Campers Page 1'!E17<>0,(CONCATENATE('Campers Page 1'!C17,\" \",'Campers Page 1'!B17)),\"\")","v":""},{"$f":"IF('Campers Page 1'!N17<>0,(CONCATENATE('Campers Page 1'!L17,\" \",'Campers Page 1'!K17)),\"\")","v":""},{"$f":"IF('Campers Page 2'!E16<>0,(CONCATENATE('Campers Page 2'!C16,\" \",'Campers Page 2'!B16)),\"\")","v":""},{"$f":"IF('Campers Page 2'!N16<>0,(CONCATENATE('Campers Page 2'!L16,\" \",'Campers Page 2'!K16)),\"\")","v":""},null,{"$f":"IF('Leaders & Financials'!E7<>0,(CONCATENATE('Leaders & Financials'!C7,\" \",'Leaders & Financials'!B7)),\"\")","v":""}]
[null,null,"Area Name",{"$f":"'Campers Page 1'!L8","v":0},null,{"$f":"IF('Hidden Sheet'!C5='Hidden Sheet'!C2,\"\",\"Double Check Camper Names - Total Number Doesn't Match A Form\")","v":""},null,null,null,null,null,null,null,null,null,null,null,null,null,null,{"$f":"IF('Campers Page 1'!E18<>0,(CONCATENATE('Campers Page 1'!C18,\" \",'Campers Page 1'!B18)),\"\")","v":""},{"$f":"IF('Campers Page 1'!N18<>0,(CONCATENATE('Campers Page 1'!L18,\" \",'Campers Page 1'!K18)),\"\")","v":""},{"$f":"IF('Campers Page 2'!E17<>0,(CONCATENATE('Campers Page 2'!C17,\" \",'Campers Page 2'!B17)),\"\")","v":""},{"$f":"IF('Campers Page 2'!N17<>0,(CONCATENATE('Campers Page 2'!L17,\" \",'Campers Page 2'!K17)),\"\")","v":""},null,{"$f":"IF('Leaders & Financials'!E8<>0,(CONCATENATE('Leaders & Financials'!C8,\" \",'Leaders & Financials'!B8)),\"\")","v":""}]
[null,null,null,null,null,null,null,null,null,null,null,null,null,null,null,null,null,null,null,null,{"$f":"IF('Campers Page 1'!E19<>0,(CONCATENATE('Campers Page 1'!C19,\" \",'Campers Page 1'!B19)),\"\")","v":""},{"$f":"IF('Campers Page 1'!N19<>0,(CONCATENATE('Campers Page 1'!L19,\" \",'Campers Page 1'!K19)),\"\")","v":""},{"$f":"IF('Campers Page 2'!E18<>0,(CONCATENATE('Campers Page 2'!C18,\" \",'Campers Page 2'!B18)),\"\")","v":""},{"$f":"IF('Campers Page 2'!N18<>0,(CONCATENATE('Campers Page 2'!L18,\" \",'Campers Page 2'!K18)),\"\")","v":""},null,{"$f":"IF('Leaders & Financials'!E9<>0,(CONCATENATE('Leaders & Financials'!C9,\" \",'Leaders & Financials'!B9)),\"\")","v":""}]
[null,null,null,null,null,null,null,null,null,null,null,null,null,null,null,null,null,null,null,null,{"$f":"IF('Campers Page 1'!E20<>0,(CONCATENATE('Campers Page 1'!C20,\" \",'Campers Page 1'!B20)),\"\")","v":""},{"$f":"IF('Campers Page 1'!N20<>0,(CONCATENATE('Campers Page 1'!L20,\" \",'Campers Page 1'!K20)),\"\")","v":""},{"$f":"IF('Campers Page 2'!E19<>0,(CONCATENATE('Campers Page 2'!C19,\" \",'Campers Page 2'!B19)),\"\")","v":""},{"$f":"IF('Campers Page 2'!N19<>0,(CONCATENATE('Campers Page 2'!L19,\" \",'Campers Page 2'!K19)),\"\")","v":""},null,{"$f":"IF('Leaders & Financials'!E10<>0,(CONCATENATE('Leaders & Financials'!C10,\" \",'Leaders & Financials'!B10)),\"\")","v":""}]
[null,"Female Cabin One",null,null,null,null,null,"Female Cabin Two",null,null,null,null,null,"Female Cabin Three",null,null,null,null,null,null,{"$f":"IF('Campers Page 1'!E21<>0,(CONCATENATE('Campers Page 1'!C21,\" \",'Campers Page 1'!B21)),\"\")","v":""},{"$f":"IF('Campers Page 1'!N21<>0,(CONCATENATE('Campers Page 1'!L21,\" \",'Campers Page 1'!K21)),\"\")","v":""},{"$f":"IF('Campers Page 2'!E20<>0,(CONCATENATE('Campers Page 2'!C20,\" \",'Campers Page 2'!B20)),\"\")","v":""},{"$f":"IF('Campers Page 2'!N20<>0,(CONCATENATE('Campers Page 2'!L20,\" \",'Campers Page 2'!K20)),\"\")","v":""},null,{"$f":"IF('Leaders & Financials'!E11<>0,(CONCATENATE('Leaders & Financials'!C11,\" \",'Leaders & Financials'!B11)),\"\")","v":""}]
{"$rows_left_out":113}
{"sheet":"Housing Request","index":8,"n_rows":60,"n_cols":14,"rows_kept":60,"cut":false,"hidden":false,"merged":[[3,4,3,14],[2,4,2,14],[57,8,57,9],[58,8,58,9],[59,8,59,9],[55,8,55,9],[56,8,56,9],[27,8,27,9],[23,8,23,9],[24,8,24,9],[25,8,25,9],[26,8,26,9],[11,5,11,6],[28,8,28,9],[29,8,29,9],[30,8,30,9],[51,2,51,3],[51,8,51,9],[52,2,52,3],[52,8,52,9],[53,2,53,3],[53,8,53,9],[48,2,48,3],[48,8,48,9],[49,2,49,3],[49,8,49,9],[50,2,50,3],[50,8,50,9],[45,2,45,3],[45,8,45,9],[46,2,46,3],[46,8,46,9],[47,2,47,3],[47,8,47,9],[42,2,42,3],[42,8,42,9],[43,2,43,3],[43,8,43,9],[44,2,44,3],[44,8,44,9],[38,2,38,3],[35,8,35,9],[34,8,34,9],[36,8,36,9],[37,8,37,9],[38,8,38,9],[34,2,34,3],[35,2,35,3],[12,5,12,6],[21,2,21,3],[22,2,22,3],[36,2,36,3],[37,2,37,3],[0,4,0,14],[57,2,57,3],[58,2,58,3],[1,4,1,14],[27,2,27,3],[28,2,28,3],[29,2,29,3],[23,2,23,3],[24,2,24,3],[25,2,25,3],[26,2,26,3],[4,1,4,2],[6,1,6,2],[8,1,8,2],[22,8,22,9],[17,1,17,13],[59,2,59,3],[55,2,55,3],[56,2,56,3],[8,11,8,12],[6,4,6,5],[8,4,8,6],[6,11,6,12],[30,2,30,3],[31,2,31,3],[32,2,32,3],[6,7,6,8],[21,8,21,9],[31,8,31,9],[32,8,32,9],[15,1,15,13],[10,5,10,6]]}
[null,null,null,null,"HOUSING REQUEST FORM"]
[null,null,null,null,{"$f":"'Campers Page 1'!C7","v":"YL Adventures Santa Cruz"}]
[null,null,null,null,{"$f":"IF('Hidden Sheet'!C2+'Hidden Sheet'!C1='Hidden Sheet'!C5+'Hidden Sheet'!C4,\"\",\"Please complete your female cabin request on the Female Cabin Roster tab.\")","v":""}]
[null,null,null,null,{"$f":"IF('Hidden Sheet'!C8+'Hidden Sheet'!C7='Hidden Sheet'!C11+'Hidden Sheet'!C10,\"\",\"Please complete your male cabin request on the Male Cabin Roster tab.\")","v":""}]
[null,"Area Number",null,null,{"$f":"'Campers Page 1'!L7","v":0},null,null,null,null,null,"Area Name",{"$f":"'Campers Page 1'!L8","v":0}]
[]
[null,"Camp Dates",null,null,{"$f":"'Campers Page 1'!C9","v":"00:00:00"},null,"to",{"$f":"'Campers Page 1'!E9","v":"00:00:00"},null,"Preferred Area Name"]
[]
{"$rows_left_out":53}
{"sheet":"Housing List","index":9,"n_rows":552,"n_cols":7,"rows_kept":552,"cut":false,"hidden":true,"merged":[]}
[{"$f":"'Housing Request'!$E$5","v":0},{"$f":"'Female Cabin Roster'!E10","v":0},"F","Leader",{"$f":"'Female Cabin Roster'!$B$8","v":"Female Cabin One"},{"$f":"IF(G1<=6,\"SS\",(IF(G1<300,\"BA\",\"HS\")))","v":{"$error":"#VALUE!"}},{"$f":"INT(LEFT(E1,3))","v":{"$error":"#VALUE!"}}]
[{"$f":"'Housing Request'!$E$5","v":0},{"$f":"'Female Cabin Roster'!E11","v":0},"F","Leader",{"$f":"'Female Cabin Roster'!$B$8","v":"Female Cabin One"},{"$error":"#VALUE!"},{"$error":"#VALUE!"}]
[{"$f":"'Housing Request'!$E$5","v":0},{"$f":"'Female Cabin Roster'!E12","v":0},"F","Leader",{"$f":"'Female Cabin Roster'!$B$8","v":"Female Cabin One"},{"$error":"#VALUE!"},{"$error":"#VALUE!"}]
[{"$f":"'Housing Request'!$E$5","v":0},{"$f":"'Female Cabin Roster'!E13","v":0},"F","Leader",{"$f":"'Female Cabin Roster'!$B$8","v":"Female Cabin One"},{"$error":"#VALUE!"},{"$error":"#VALUE!"}]
[{"$f":"'Housing Request'!$E$5","v":0},{"$f":"'Female Cabin Roster'!E14","v":0},"F","Leader",{"$f":"'Female Cabin Roster'!$B$8","v":"Female Cabin One"},{"$error":"#VALUE!"},{"$error":"#VALUE!"}]
[{"$f":"'Housing Request'!$E$5","v":0},{"$f":"'Female Cabin Roster'!E16","v":0},"F","Camper",{"$f":"'Female Cabin Roster'!$B$8","v":"Female Cabin One"},{"$error":"#VALUE!"},{"$error":"#VALUE!"}]
[{"$f":"'Housing Request'!$E$5","v":0},{"$f":"'Female Cabin Roster'!E17","v":0},"F","Camper",{"$f":"'Female Cabin Roster'!$B$8","v":"Female Cabin One"},{"$error":"#VALUE!"},{"$error":"#VALUE!"}]
[{"$f":"'Housing Request'!$E$5","v":0},{"$f":"'Female Cabin Roster'!E18","v":0},"F","Camper",{"$f":"'Female Cabin Roster'!$B$8","v":"Female Cabin One"},{"$error":"#VALUE!"},{"$error":"#VALUE!"}]
{"$rows_left_out":544}