{"text_format":"1","workbook":"xlsx","n_sheets":12,"sheets":["Instructions","Area Registration","Travel Insurance","Campers & Leaders","Campers Page 2","Financials","Ethnicity Report","Male Cabin Roster","Female Cabin Roster","Housing Request","Hidden Sheet","Housing List"],"not_rendered":{"charts":0,"images":3,"macros":1,"external_links":0,"defined_names":13,"comments":0,"pivot_tables":0},"unopened":[],"bounds":{"document_bytes":16777216,"sheet_cells":100000,"rows_first":2000,"rows_last":500,"rows_between":2000,"halvings":0,"cell_chars":16384,"cell_head_chars":4096},"cells_cut":0,"cells_raw":0,"read":"whole","date_system":"1900"}

{"sheet":"Instructions","index":0,"n_rows":23,"n_cols":2,"rows_kept":23,"cut":false,"hidden":false,"merged":[[16,1,16,9],[19,1,19,9],[22,1,22,9],[1,0,1,5],[3,0,3,9],[12,1,12,9],[6,1,6,9],[9,1,9,9],[7,1,7,9]]}
[]
["Adventures Baja \nRegistration Packet"]
[]
["Welcome to the Adventures Baja Registration Packet.  This workbook prepopulates some of the information for you. Please read below for detailed instructions for completing each tab. Once it is completed, return to the camp office via email. Please call us at 831-331-1483 with questions!"]
[]
["Area Registration"]
[null,"Start off by entering the requested information at the top of the sheet. This information will populate other cells in the workbook. Then, fill in campers'  and leaders' full legal names and other requested information. It is imperative that you fill in ALL FIELDS of this sheet for EACH camper and leader."]
[null,"If you are copying/pasting data from another workbook, please be sure to select \"PASTE AS PLAIN TEXT\" when inserting into this registration packet."]
{"$rows_left_out":16}
{"sheet":"Area Registration","index":1,"n_rows":59,"n_cols":26,"rows_kept":59,"cut":false,"hidden":false,"merged":[[3,8,3,9],[56,3,56,4],[57,3,57,4],[56,7,56,8],[57,7,57,8],[54,1,54,8],[3,2,3,3]]}
[]
[null,"Area Registration Form"]
[]
[null,"CAMP NAME","YL Adventures Baja",null,null,null,"AREA NUMBER"]
[null,"CAMP DATES","7/5/2019 - 7/10/19",null,null,null,"AREA NAME"]
[]
[null,"First (Legal) Name","Middle Name","Last Name",null,"Camper/Leader","DOB ","Male","Female","Address","City","State","ZIP","Email Address","Shirt Size","Ethnicity","Passport #","PP exp. date"]
[1,null,null,null,null,"Camper",null,null,null,null,null,null,null,null,null,null,null,null,null,null,"Caucasian","African American","Latino/Hispanic","Asian/Pacific Islander","Native American/Native Alaskan","Other/Multi Racial"]
{"$rows_left_out":52}
{"sheet":"Travel Insurance","index":2,"n_rows":50,"n_cols":13,"rows_kept":50,"cut":false,"hidden":false,"merged":[]}
[]
[null,"Travel Insurance Information"]
[]
[null,"First (Legal) Name","Middle Name","Last Name","DOB","Address","City","State","ZIP","Destination Country","Departure Date","Return Date","Total Trip Cost"]
[1,{"$f":"IF('Area Registration'!B8=\"\",\"\",'Area Registration'!B8)","v":""},{"$f":"IF('Area Registration'!C8=\"\",\"\",'Area Registration'!C8)","v":""},{"$f":"IF('Area Registration'!D8=\"\",\"\",'Area Registration'!D8)","v":""},{"$f":"IF('Area Registration'!G8=\"\",\"\",'Area Registration'!G8)","v":""},{"$f":"IF('Area Registration'!J8=\"\",\"\",'Area Registration'!J8)","v":""},{"$f":"IF('Area Registration'!K8=\"\",\"\",'Area Registration'!K8)","v":""},{"$f":"IF('Area Registration'!L8=\"\",\"\",'Area Registration'!L8)","v":""},{"$f":"IF('Area Registration'!M8=\"\",\"\",'Area Registration'!M8)","v":""}]
[2,{"$f":"IF('Area Registration'!B9=\"\",\"\",'Area Registration'!B9)","v":""},{"$f":"IF('Area Registration'!C9=\"\",\"\",'Area Registration'!C9)","v":""},{"$f":"IF('Area Registration'!D9=\"\",\"\",'Area Registration'!D9)","v":""},{"$f":"IF('Area Registration'!G9=\"\",\"\",'Area Registration'!G9)","v":""},{"$f":"IF('Area Registration'!J9=\"\",\"\",'Area Registration'!J9)","v":""},{"$f":"IF('Area Registration'!K9=\"\",\"\",'Area Registration'!K9)","v":""},{"$f":"IF('Area Registration'!L9=\"\",\"\",'Area Registration'!L9)","v":""},{"$f":"IF('Area Registration'!M9=\"\",\"\",'Area Registration'!M9)","v":""}]
[3,{"$f":"IF('Area Registration'!B10=\"\",\"\",'Area Registration'!B10)","v":""},{"$f":"IF('Area Registration'!C10=\"\",\"\",'Area Registration'!C10)","v":""},{"$f":"IF('Area Registration'!D10=\"\",\"\",'Area Registration'!D10)","v":""},{"$f":"IF('Area Registration'!G10=\"\",\"\",'Area Registration'!G10)","v":""},{"$f":"IF('Area Registration'!J10=\"\",\"\",'Area Registration'!J10)","v":""},{"$f":"IF('Area Registration'!K10=\"\",\"\",'Area Registration'!K10)","v":""},{"$f":"IF('Area Registration'!L10=\"\",\"\",'Area Registration'!L10)","v":""},{"$f":"IF('Area Registration'!M10=\"\",\"\",'Area Registration'!M10)","v":""}]
[4,{"$f":"IF('Area Registration'!B11=\"\",\"\",'Area Registration'!B11)","v":""},{"$f":"IF('Area Registration'!C11=\"\",\"\",'Area Registration'!C11)","v":""},{"$f":"IF('Area Registration'!D11=\"\",\"\",'Area Registration'!D11)","v":""},{"$f":"IF('Area Registration'!G11=\"\",\"\",'Area Registration'!G11)","v":""},{"$f":"IF('Area Registration'!J11=\"\",\"\",'Area Registration'!J11)","v":""},{"$f":"IF('Area Registration'!K11=\"\",\"\",'Area Registration'!K11)","v":""},{"$f":"IF('Area Registration'!L11=\"\",\"\",'Area Registration'!L11)","v":""},{"$f":"IF('Area Registration'!M11=\"\",\"\",'Area Registration'!M11)","v":""}]
{"$rows_left_out":43}
{"sheet":"Campers & Leaders","index":3,"n_rows":56,"n_cols":20,"rows_kept":56,"cut":false,"hidden":false,"merged":[[1,2,4,13],[13,1,13,7],[13,10,13,16],[8,4,8,7],[6,2,6,7]]}
[]
[null,null,"YOUNG LIFE SUMMER CAMP REGISTRATION"]
[]
[]
[]
[]
[null,"CAMP NAME","YL Adventures Baja",null,null,null,null,null,null,null,"AREA NUMBER",{"$f":"'Area Registration'!I4","v":0}]
[null,"CAMP TYPE","Creative Camping Adventure",null,null,null,null,null,null,null,"AREA NAME",{"$f":"'Area Registration'!I5","v":0}]
{"$rows_left_out":49}
{"sheet":"Campers Page 2","index":4,"n_rows":61,"n_cols":20,"rows_kept":61,"cut":false,"hidden":true,"merged":[[13,1,13,7],[13,10,13,16],[10,1,11,16],[1,2,4,13],[6,2,6,7],[7,2,7,7],[7,11,7,16],[8,4,8,7]]}
[]
[null,null,"YOUNG LIFE SUMMER CAMP REGISTRATION"]
[]
[]
[]
[]
[null,"CAMP NAME",{"$f":"'Campers & Leaders'!C7:H7","v":"YL Adventures Baja"},null,null,null,null,null,null,null,"AREA NUMBER",{"$f":"'Campers & Leaders'!L7","v":0}]
[null,"CAMP TYPE",{"$f":"'Campers & Leaders'!C8:H8","v":"Creative Camping Adventure"},null,null,null,null,null,null,null,"AREA NAME",{"$f":"'Campers & Leaders'!L8:Q8","v":0}]
{"$rows_left_out":54}
{"sheet":"Financials","index":5,"n_rows":39,"n_cols":8,"rows_kept":39,"cut":false,"hidden":false,"merged":[[34,1,34,2],[36,1,36,3],[37,1,37,3],[47,1,47,2],[43,2,43,3],[44,2,44,3],[38,1,38,3],[41,1,41,4],[21,3,21,4],[25,0,25,3],[26,0,26,3],[32,1,32,2],[33,1,33,2],[4,1,4,4],[5,1,5,4],[6,1,6,4],[3,2,3,4],[30,1,30,3],[10,2,10,3],[10,4,11,4],[12,1,12,4],[13,1,13,3],[14,1,14,3],[18,1,18,4],[28,1,28,4],[29,1,29,3],[15,1,15,3],[16,1,16,3],[19,1,19,4]]}
[]
[null,null,"FINANCIAL SUMMARY"]
[]
[null,{"$f":"'Campers & Leaders'!L7","v":0},{"$f":"'Campers & Leaders'!L8","v":0}]
[null,"FINANCIAL SUMMARY"]
[null,"TRIP LEADER: DO NOT COMPLETE THIS SECTION\nCompleted by camp office during payment"]
[null,"CAMP FEES",null,null,null,null,"Beyond Malibu","6th Grade Outreach"]
[null,null,"Number","x Camp Fee","= Amount",null,"Breakaway Lodge","9th Grade Outreach"]
{"$rows_left_out":32}
{"sheet":"Ethnicity Report","index":6,"n_rows":17,"n_cols":9,"rows_kept":17,"cut":false,"hidden":false,"merged":[[5,1,5,8],[13,2,13,8],[14,2,14,8],[16,1,16,6]]}
[]
[null,"Area #",{"$f":"'Area Registration'!I4","v":0}]
[null,"Area Name",{"$f":"'Area Registration'!I5","v":0}]
[]
[]
[null,"We collect information from each area on the ethnic background of their campers and leaders. Complete the boxes below as they pertain to your group. When the numbers you entered equals the total campers on the A Form, the Totals column will no longer be highlighted. Thank you for providing this information to aid mission leadership in decision making!"]
[]
[]
{"$rows_left_out":10}
{"sheet":"Male Cabin Roster","index":7,"n_rows":33,"n_cols":25,"rows_kept":33,"cut":false,"hidden":false,"merged":[[0,23,2,24],[4,6,4,16],[7,1,7,5],[7,7,7,11],[7,13,7,17],[5,2,5,17],[2,0,2,16],[1,1,1,13],[3,6,3,16],[3,3,3,4],[0,20,2,21]]}
[null,null,null,null,null,null,null,null,null,null,null,null,null,null,null,null,null,null,null,null,"Male Camper Name List\n(name will disappear when assigned to housing)",null,null,"Male Leader Name List"]
[null,"Adventures Baja 1st Choice Male Cabin Roster"]
[]
[null,null,"Area #",{"$f":"'Campers & Leaders'!L7","v":0},null,null,null,null,null,null,null,null,null,null,null,null,null,null,null,null,{"$f":"IF('Campers & Leaders'!D16=\"M\",(CONCATENATE('Campers & Leaders'!C16,\" \",'Campers & Leaders'!B16)),\"\")","v":""},{"$f":"IF('Campers & Leaders'!D34=\"M\",(CONCATENATE('Campers & Leaders'!C34,\" \",'Campers & Leaders'!B34)),\"\")","v":""},null,{"$f":"IF('Campers & Leaders'!M16=\"M\",(CONCATENATE('Campers & Leaders'!L16,\" \",'Campers & Leaders'!K16)),\"\")","v":""},{"$f":"IF('Campers & Leaders'!M34=\"M\",(CONCATENATE('Campers & Leaders'!L34,\" \",'Campers & Leaders'!K34)),\"\")","v":""}]
[null,null,"Area Name",{"$f":"'Campers & Leaders'!L8","v":0},null,null,null,null,null,null,null,null,null,null,null,null,null,null,null,null,{"$f":"IF('Campers & Leaders'!D17=\"M\",(CONCATENATE('Campers & Leaders'!C17,\" \",'Campers & Leaders'!B17)),\"\")","v":""},{"$f":"IF('Campers & Leaders'!D35=\"M\",(CONCATENATE('Campers & Leaders'!C35,\" \",'Campers & Leaders'!B35)),\"\")","v":""},null,{"$f":"IF('Campers & Leaders'!M17=\"M\",(CONCATENATE('Campers & Leaders'!L17,\" \",'Campers & Leaders'!K17)),\"\")","v":""},{"$f":"IF('Campers & Leaders'!M35=\"M\",(CONCATENATE('Campers & Leaders'!L35,\" \",'Campers & Leaders'!K35)),\"\")","v":""}]
[null,null,"**REMINDER: Cabins at Adventures Baja sleep 12 people TOTAL**",null,null,null,null,null,null,null,null,null,null,null,null,null,null,null,null,null,{"$f":"IF('Campers & Leaders'!D18=\"M\",(CONCATENATE('Campers & Leaders'!C18,\" \",'Campers & Leaders'!B18)),\"\")","v":""},{"$f":"IF('Campers & Leaders'!D36=\"M\",(CONCATENATE('Campers & Leaders'!C36,\" \",'Campers & Leaders'!B36)),\"\")","v":""},null,{"$f":"IF('Campers & Leaders'!M18=\"M\",(CONCATENATE('Campers & Leaders'!L18,\" \",'Campers & Leaders'!K18)),\"\")","v":""},{"$f":"IF('Campers & Leaders'!M36=\"M\",(CONCATENATE('Campers & Leaders'!L36,\" \",'Campers & Leaders'!K36)),\"\")","v":""}]
[null,null,null,null,null,null,null,null,null,null,null,null,null,null,null,null,null,null,null,null,{"$f":"IF('Campers & Leaders'!D19=\"M\",(CONCATENATE('Campers & Leaders'!C19,\" \",'Campers & Leaders'!B19)),\"\")","v":""},{"$f":"IF('Campers & Leaders'!D37=\"M\",(CONCATENATE('Campers & Leaders'!C37,\" \",'Campers & Leaders'!B37)),\"\")","v":""},null,{"$f":"IF('Campers & Leaders'!M19=\"M\",(CONCATENATE('Campers & Leaders'!L19,\" \",'Campers & Leaders'!K19)),\"\")","v":""},{"$f":"IF('Campers & Leaders'!M37=\"M\",(CONCATENATE('Campers & Leaders'!L37,\" \",'Campers & Leaders'!K37)),\"\")","v":""}]
[null,"Male Cabin One",null,null,null,null,null,"Male Cabin Two",null,null,null,null,null,"Male Cabin Three",null,null,null,null,null,null,{"$f":"IF('Campers & Leaders'!D20=\"M\",(CONCATENATE('Campers & Leaders'!C20,\" \",'Campers & Leaders'!B20)),\"\")","v":""},{"$f":"IF('Campers & Leaders'!D38=\"M\",(CONCATENATE('Campers & Leaders'!C38,\" \",'Campers & Leaders'!B38)),\"\")","v":""},null,{"$f":"IF('Campers & Leaders'!M20=\"M\",(CONCATENATE('Campers & Leaders'!L20,\" \",'Campers & Leaders'!K20)),\"\")","v":""},{"$f":"IF('Campers & Leaders'!M38=\"M\",(CONCATENATE('Campers & Leaders'!L38,\" \",'Campers & Leaders'!K38)),\"\")","v":""}]
{"$rows_left_out":26}
{"sheet":"Female Cabin Roster","index":8,"n_rows":36,"n_cols":25,"rows_kept":36,"cut":false,"hidden":false,"merged":[[0,20,2,21],[0,23,2,24],[7,13,7,17],[2,0,2,16],[7,1,7,5],[7,7,7,11],[1,1,1,13],[3,5,3,16],[4,5,4,16],[3,3,3,4],[5,2,5,17]]}
[null,null,null,null,null,null,null,null,null,null,null,null,null,null,null,null,null,null,null,null,"Female Camper Name List\n(name will disappear when assigned to housing)",null,null,"Female Leader Name List"]
[null,"Adventures Baja 1st Choice Female Cabin Roster"]
[]
[null,null,"Area #",{"$f":"'Campers & Leaders'!L7","v":0},null,null,null,null,null,null,null,null,null,null,null,null,null,null,null,null,{"$f":"IF('Campers & Leaders'!E16=\"F\",(CONCATENATE('Campers & Leaders'!C16,\" \",'Campers & Leaders'!B16)),\"\")","v":""},{"$f":"IF('Campers & Leaders'!E34=\"F\",(CONCATENATE('Campers & Leaders'!C34,\" \",'Campers & Leaders'!B34)),\"\")","v":""},null,{"$f":"IF('Campers & Leaders'!N16=\"F\",(CONCATENATE('Campers & Leaders'!L16,\" \",'Campers & Leaders'!K16)),\"\")","v":""},{"$f":"IF('Campers & Leaders'!O16=\"F\",(CONCATENATE('Campers & Leaders'!M16,\" \",'Campers & Leaders'!L16)),\"\")","v":""}]
[null,null,"Area Name",{"$f":"'Campers & Leaders'!L8","v":0},null,null,null,null,null,null,null,null,null,null,null,null,null,null,null,null,{"$f":"IF('Campers & Leaders'!E17=\"F\",(CONCATENATE('Campers & Leaders'!C17,\" \",'Campers & Leaders'!B17)),\"\")","v":""},{"$f":"IF('Campers & Leaders'!E35=\"F\",(CONCATENATE('Campers & Leaders'!C35,\" \",'Campers & Leaders'!B35)),\"\")","v":""},null,{"$f":"IF('Campers & Leaders'!N17=\"F\",(CONCATENATE('Campers & Leaders'!L17,\" \",'Campers & Leaders'!K17)),\"\")","v":""},{"$f":"IF('Campers & Leaders'!O17=\"F\",(CONCATENATE('Campers & Leaders'!M17,\" \",'Campers & Leaders'!L17)),\"\")","v":""}]
[null,null,"**REMINDER: Cabins at Adventures Baja sleep 12 people TOTAL**",null,null,null,null,null,null,null,null,null,null,null,null,null,null,null,null,null,{"$f":"IF('Campers & Leaders'!E18=\"F\",(CONCATENATE('Campers & Leaders'!C18,\" \",'Campers & Leaders'!B18)),\"\")","v":""},{"$f":"IF('Campers & Leaders'!E36=\"F\",(CONCATENATE('Campers & Leaders'!C36,\" \",'Campers & Leaders'!B36)),\"\")","v":""},null,{"$f":"IF('Campers & Leaders'!N18=\"F\",(CONCATENATE('Campers & Leaders'!L18,\" \",'Campers & Leaders'!K18)),\"\")","v":""},{"$f":"IF('Campers & Leaders'!O18=\"F\",(CONCATENATE('Campers & Leaders'!M18,\" \",'Campers & Leaders'!L18)),\"\")","v":""}]
[null,null,null,null,null,null,null,null,null,null,null,null,null,null,null,null,null,null,null,null,{"$f":"IF('Campers & Leaders'!E19=\"F\",(CONCATENATE('Campers & Leaders'!C19,\" \",'Campers & Leaders'!B19)),\"\")","v":""},{"$f":"IF('Campers & Leaders'!E37=\"F\",(CONCATENATE('Campers & Leaders'!C37,\" \",'Campers & Leaders'!B37)),\"\")","v":""},null,{"$f":"IF('Campers & Leaders'!N19=\"F\",(CONCATENATE('Campers & Leaders'!L19,\" \",'Campers & Leaders'!K19)),\"\")","v":""},{"$f":"IF('Campers & Leaders'!O19=\"F\",(CONCATENATE('Campers & Leaders'!M19,\" \",'Campers & Leaders'!L19)),\"\")","v":""}]
[null,"Female Cabin One",null,null,null,null,null,"Female Cabin Two",null,null,null,null,null,"Female Cabin Three",null,null,null,null,null,null,{"$f":"IF('Campers & Leaders'!E20=\"F\",(CONCATENATE('Campers & Leaders'!C20,\" \",'Campers & Leaders'!B20)),\"\")","v":""},{"$f":"IF('Campers & Leaders'!E38=\"F\",(CONCATENATE('Campers & Leaders'!C38,\" \",'Campers & Leaders'!B38)),\"\")","v":""},null,{"$f":"IF('Campers & Leaders'!N20=\"F\",(CONCATENATE('Campers & Leaders'!L20,\" \",'Campers & Leaders'!K20)),\"\")","v":""},{"$f":"IF('Campers & Leaders'!O20=\"F\",(CONCATENATE('Campers & Leaders'!M20,\" \",'Campers & Leaders'!L20)),\"\")","v":""}]
{"$rows_left_out":29}
{"sheet":"Housing Request","index":9,"n_rows":32,"n_cols":14,"rows_kept":32,"cut":false,"hidden":false,"merged":[[0,4,0,14],[1,4,1,14],[24,2,24,3],[4,1,4,2],[6,1,6,2],[8,1,8,2],[22,8,22,9],[17,1,17,13],[8,11,8,12],[8,4,8,6],[6,11,6,12],[6,7,6,8],[21,8,21,9],[15,1,15,13],[10,5,10,6],[23,2,23,3],[30,2,30,3],[31,2,31,3],[31,8,31,9],[28,2,28,3],[28,8,28,9],[29,2,29,3],[29,8,29,9],[21,2,21,3],[22,2,22,3],[3,4,3,14],[2,4,2,14],[24,8,24,9],[11,5,11,6],[12,5,12,6]]}
[null,null,null,null,"HOUSING REQUEST FORM"]
[]
[]
[]
[null,"Area Number",null,null,{"$f":"'Area Registration'!I4","v":0},null,null,null,null,null,"Area Name",{"$f":"'Area Registration'!$I$5","v":0}]
[]
[null,"Camp Dates",null,null,{"$f":"'Area Registration'!$C$5","v":"7/5/2019 - 7/10/19"},null,null,{"$f":"'Area Registration'!$F$5","v":"00:00:00"},null,"Preferred Area Name"]
[]
{"$rows_left_out":25}
{"sheet":"Hidden Sheet","index":10,"n_rows":163,"n_cols":13,"rows_kept":163,"cut":false,"hidden":true,"merged":[]}
[null,"Female Leader Total From A Form",{"$f":"Financials!#REF!","v":{"$error":"#REF!"}},null,"Female Camper Names","Male Camper Names","Female Leader Names","Male Leader Names",null,"Actual Female Camper Name","Actual Male Camper Names","Actual Female Leader Names","Actual Male Leader Names"]
[null,"Female Camper Total From A Form",{"$f":"'Campers Page 2'!N57","v":0}]
[null,null,null,null,{"$f":"IF('Campers & Leaders'!E16=\"F\",(CONCATENATE('Campers & Leaders'!C16,\" \",'Campers & Leaders'!B16)),\"\")","v":""},{"$f":"IF('Campers & Leaders'!D16=\"M\",(CONCATENATE('Campers & Leaders'!C16,\" \",'Campers & Leaders'!B16)),\"\")","v":""},{"$f":"IF('Campers & Leaders'!N16=\"F\",(CONCATENATE('Campers & Leaders'!L16,\" \",'Campers & Leaders'!K16)),\"\")","v":""},{"$f":"IF('Campers & Leaders'!M16=\"M\",(CONCATENATE('Campers & Leaders'!L16,\" \",'Campers & Leaders'!K16)),\"\")","v":""},null,{"$f":"IFERROR(INDEX($E$2:$E$162,SMALL(IF(($E$2:$E$162)<>\"\",ROW($E$1:$E$161),\"\"),ROW(J1))),\"\")","v":""},{"$f":"IFERROR(INDEX($F$2:$F$162,SMALL(IF(($F$2:$F$162)<>\"\",ROW($F$1:$F$161),\"\"),ROW(K1))),\"\")","v":""},{"$f":"IFERROR(INDEX($G$2:$G$32,SMALL(IF(($G$2:$G$32)<>\"\",ROW($G$1:$G$31),\"\"),ROW(L1))),\"\")","v":""},{"$f":"IFERROR(INDEX($H$2:$H$32,SMALL(IF(($H$2:$H$32)<>\"\",ROW($H$1:$H$31),\"\"),ROW(M1))),\"\")","v":""}]
[null,"Female Leader Total From Cabin Roster",{"$f":"COUNTA('Female Cabin Roster'!E10:E14,'Female Cabin Roster'!K10:K14,'Female Cabin Roster'!Q10:Q14,'Female Cabin Roster'!#REF!,'Female Cabin Roster'!#REF!,'Female Cabin Roster'!#REF!,'Female Cabin Roster'!#REF!,'Female Cabin Roster'!#REF!,'Female Cabin Roster'!#REF!,'Female Cabin Roster'!#REF!,'Female Cabin Roster'!#REF!,'Female Cabin Roster'!#REF!)","v":9},null,{"$f":"IF('Campers & Leaders'!E17=\"F\",(CONCATENATE('Campers & Leaders'!C17,\" \",'Campers & Leaders'!B17)),\"\")","v":""},{"$f":"IF('Campers & Leaders'!D17=\"M\",(CONCATENATE('Campers & Leaders'!C17,\" \",'Campers & Leaders'!B17)),\"\")","v":""},{"$f":"IF('Campers & Leaders'!N17=\"F\",(CONCATENATE('Campers & Leaders'!L17,\" \",'Campers & Leaders'!K17)),\"\")","v":""},{"$f":"IF('Campers & Leaders'!M17=\"M\",(CONCATENATE('Campers & Leaders'!L17,\" \",'Campers & Leaders'!K17)),\"\")","v":""},null,{"$f":"IFERROR(INDEX($E$2:$E$162,SMALL(IF(($E$2:$E$162)<>\"\",ROW($E$1:$E$161),\"\"),ROW(J2))),\"\")","v":""},{"$f":"IFERROR(INDEX($F$2:$F$162,SMALL(IF(($F$2:$F$162)<>\"\",ROW($F$1:$F$161),\"\"),ROW(K2))),\"\")","v":""},{"$f":"IFERROR(INDEX($G$2:$G$32,SMALL(IF(($G$2:$G$32)<>\"\",ROW($G$1:$G$31),\"\"),ROW(L2))),\"\")","v":""},{"$f":"IFERROR(INDEX($H$2:$H$32,SMALL(IF(($H$2:$H$32)<>\"\",ROW($H$1:$H$31),\"\"),ROW(M2))),\"\")","v":""}]
[null,"Female Camper Total From Cabin Roster",{"$f":"COUNTA('Female Cabin Roster'!E16:E33,'Female Cabin Roster'!K16:K33,'Female Cabin Roster'!Q16:Q33,'Female Cabin Roster'!#REF!,'Female Cabin Roster'!#REF!,'Female Cabin Roster'!#REF!,'Female Cabin Roster'!#REF!,'Female Cabin Roster'!#REF!,'Female Cabin Roster'!#REF!,'Female Cabin Roster'!#REF!,'Female Cabin Roster'!#REF!,'Female Cabin Roster'!#REF!)","v":9},null,{"$f":"IF('Campers & Leaders'!E18=\"F\",(CONCATENATE('Campers & Leaders'!C18,\" \",'Campers & Leaders'!B18)),\"\")","v":""},{"$f":"IF('Campers & Leaders'!D18=\"M\",(CONCATENATE('Campers & Leaders'!C18,\" \",'Campers & Leaders'!B18)),\"\")","v":""},{"$f":"IF('Campers & Leaders'!N18=\"F\",(CONCATENATE('Campers & Leaders'!L18,\" \",'Campers & Leaders'!K18)),\"\")","v":""},{"$f":"IF('Campers & Leaders'!M18=\"M\",(CONCATENATE('Campers & Leaders'!L18,\" \",'Campers & Leaders'!K18)),\"\")","v":""},null,{"$f":"IFERROR(INDEX($E$2:$E$162,SMALL(IF(($E$2:$E$162)<>\"\",ROW($E$1:$E$161),\"\"),ROW(J3))),\"\")","v":""},{"$f":"IFERROR(INDEX($F$2:$F$162,SMALL(IF(($F$2:$F$162)<>\"\",ROW($F$1:$F$161),\"\"),ROW(K3))),\"\")","v":""},{"$f":"IFERROR(INDEX($G$2:$G$32,SMALL(IF(($G$2:$G$32)<>\"\",ROW($G$1:$G$31),\"\"),ROW(L3))),\"\")","v":""},{"$f":"IFERROR(INDEX($H$2:$H$32,SMALL(IF(($H$2:$H$32)<>\"\",ROW($H$1:$H$31),\"\"),ROW(M3))),\"\")","v":""}]
[null,null,null,null,{"$f":"IF('Campers & Leaders'!E19=\"F\",(CONCATENATE('Campers & Leaders'!C19,\" \",'Campers & Leaders'!B19)),\"\")","v":""},{"$f":"IF('Campers & Leaders'!D19=\"M\",(CONCATENATE('Campers & Leaders'!C19,\" \",'Campers & Leaders'!B19)),\"\")","v":""},{"$f":"IF('Campers & Leaders'!N19=\"F\",(CONCATENATE('Campers & Leaders'!L19,\" \",'Campers & Leaders'!K19)),\"\")","v":""},{"$f":"IF('Campers & Leaders'!M19=\"M\",(CONCATENATE('Campers & Leaders'!L19,\" \",'Campers & Leaders'!K19)),\"\")","v":""},null,{"$f":"IFERROR(INDEX($E$2:$E$162,SMALL(IF(($E$2:$E$162)<>\"\",ROW($E$1:$E$161),\"\"),ROW(J4))),\"\")","v":""},{"$f":"IFERROR(INDEX($F$2:$F$162,SMALL(IF(($F$2:$F$162)<>\"\",ROW($F$1:$F$161),\"\"),ROW(K4))),\"\")","v":""},{"$f":"IFERROR(INDEX($G$2:$G$32,SMALL(IF(($G$2:$G$32)<>\"\",ROW($G$1:$G$31),\"\"),ROW(L4))),\"\")","v":""},{"$f":"IFERROR(INDEX($H$2:$H$32,SMALL(IF(($H$2:$H$32)<>\"\",ROW($H$1:$H$31),\"\"),ROW(M4))),\"\")","v":""}]
[null,"Male Leader Total From A Form",{"$f":"Financials!#REF!","v":{"$error":"#REF!"}},null,{"$f":"IF('Campers & Leaders'!E20=\"F\",(CONCATENATE('Campers & Leaders'!C20,\" \",'Campers & Leaders'!B20)),\"\")","v":""},{"$f":"IF('Campers & Leaders'!D20=\"M\",(CONCATENATE('Campers & Leaders'!C20,\" \",'Campers & Leaders'!B20)),\"\")","v":""},{"$f":"IF('Campers & Leaders'!N20=\"F\",(CONCATENATE('Campers & Leaders'!L20,\" \",'Campers & Leaders'!K20)),\"\")","v":""},{"$f":"IF('Campers & Leaders'!M20=\"M\",(CONCATENATE('Campers & Leaders'!L20,\" \",'Campers & Leaders'!K20)),\"\")","v":""},null,{"$f":"IFERROR(INDEX($E$2:$E$162,SMALL(IF(($E$2:$E$162)<>\"\",ROW($E$1:$E$161),\"\"),ROW(J5))),\"\")","v":""},{"$f":"IFERROR(INDEX($F$2:$F$162,SMALL(IF(($F$2:$F$162)<>\"\",ROW($F$1:$F$161),\"\"),ROW(K5))),\"\")","v":""},{"$f":"IFERROR(INDEX($G$2:$G$32,SMALL(IF(($G$2:$G$32)<>\"\",ROW($G$1:$G$31),\"\"),ROW(L5))),\"\")","v":""},{"$f":"IFERROR(INDEX($H$2:$H$32,SMALL(IF(($H$2:$H$32)<>\"\",ROW($H$1:$H$31),\"\"),ROW(M5))),\"\")","v":""}]
[null,"Male Camper Total From A Form",{"$f":"'Campers Page 2'!M57","v":0},null,{"$f":"IF('Campers & Leaders'!E21=\"F\",(CONCATENATE('Campers & Leaders'!C21,\" \",'Campers & Leaders'!B21)),\"\")","v":""},{"$f":"IF('Campers & Leaders'!D21=\"M\",(CONCATENATE('Campers & Leaders'!C21,\" \",'Campers & Leaders'!B21)),\"\")","v":""},{"$f":"IF('Campers & Leaders'!N21=\"F\",(CONCATENATE('Campers & Leaders'!L21,\" \",'Campers & Leaders'!K21)),\"\")","v":""},{"$f":"IF('Campers & Leaders'!M21=\"M\",(CONCATENATE('Campers & Leaders'!L21,\" \",'Campers & Leaders'!K21)),\"\")","v":""},null,{"$f":"IFERROR(INDEX($E$2:$E$162,SMALL(IF(($E$2:$E$162)<>\"\",ROW($E$1:$E$161),\"\"),ROW(J6))),\"\")","v":""},{"$f":"IFERROR(INDEX($F$2:$F$162,SMALL(IF(($F$2:$F$162)<>\"\",ROW($F$1:$F$161),\"\"),ROW(K6))),\"\")","v":""},{"$f":"IFERROR(INDEX($G$2:$G$32,SMALL(IF(($G$2:$G$32)<>\"\",ROW($G$1:$G$31),\"\"),ROW(L6))),\"\")","v":""},{"$f":"IFERROR(INDEX($H$2:$H$32,SMALL(IF(($H$2:$H$32)<>\"\",ROW($H$1:$H$31),\"\"),ROW(M6))),\"\")","v":""}]
{"$rows_left_out":156}
{"sheet":"Housing List","index":11,"n_rows":552,"n_cols":7,"rows_kept":552,"cut":false,"hidden":true,"merged":[]}
[{"$f":"'Housing Request'!$E$5","v":0},{"$f":"'Female Cabin Roster'!E10","v":0},"F","Leader",{"$f":"'Female Cabin Roster'!$B$8","v":"Female Cabin One"},{"$f":"IF(G1<=6,\"SS\",(IF(G1<300,\"BA\",\"HS\")))","v":{"$error":"#VALUE!"}},{"$f":"INT(LEFT(E1,3))","v":{"$error":"#VALUE!"}}]
[{"$f":"'Housing Request'!$E$5","v":0},{"$f":"'Female Cabin Roster'!E11","v":0},"F","Leader",{"$f":"'Female Cabin Roster'!$B$8","v":"Female Cabin One"},{"$error":"#VALUE!"},{"$error":"#VALUE!"}]
[{"$f":"'Housing Request'!$E$5","v":0},{"$f":"'Female Cabin Roster'!E12","v":0},"F","Leader",{"$f":"'Female Cabin Roster'!$B$8","v":"Female Cabin One"},{"$error":"#VALUE!"},{"$error":"#VALUE!"}]
[{"$f":"'Housing Request'!$E$5","v":0},{"$f":"'Female Cabin Roster'!E13","v":0},"F","Leader",{"$f":"'Female Cabin Roster'!$B$8","v":"Female Cabin One"},{"$error":"#VALUE!"},{"$error":"#VALUE!"}]
[{"$f":"'Housing Request'!$E$5","v":0},{"$f":"'Female Cabin Roster'!E14","v":0},"F","Leader",{"$f":"'Female Cabin Roster'!$B$8","v":"Female Cabin One"},{"$error":"#VALUE!"},{"$error":"#VALUE!"}]
[{"$f":"'Housing Request'!$E$5","v":0},{"$f":"'Female Cabin Roster'!E16","v":0},"F","Camper",{"$f":"'Female Cabin Roster'!$B$8","v":"Female Cabin One"},{"$error":"#VALUE!"},{"$error":"#VALUE!"}]
[{"$f":"'Housing Request'!$E$5","v":0},{"$f":"'Female Cabin Roster'!E17","v":0},"F","Camper",{"$f":"'Female Cabin Roster'!$B$8","v":"Female Cabin One"},{"$error":"#VALUE!"},{"$error":"#VALUE!"}]
[{"$f":"'Housing Request'!$E$5","v":0},{"$f":"'Female Cabin Roster'!E18","v":0},"F","Camper",{"$f":"'Female Cabin Roster'!$B$8","v":"Female Cabin One"},{"$error":"#VALUE!"},{"$error":"#VALUE!"}]
{"$rows_left_out":544}